{"text_format":"1","workbook":"xlsx","n_sheets":32,"sheets":["県域情報","List","新-様式14コピー元","新-様式14-1コピー元","新-様式14②コピー元","廃解-様式14コピー元","廃解-様式14②コピー元","概要","TOP","新規","新-様式3-1","新-様式5-1","新-様式6","新-様式14","新-様式14-1","新-様式15","新-チェックシート","新-様式8","新-様式8-1","新-様式14②","新-チェックシート②","廃止解約","廃解-様式3-1","廃解-様式10","廃解-様式5-1","廃解-様式6","廃解-様式14","廃解-チェックシート","廃解-様式8","廃解-様式8-1","廃解-様式14②","廃解-チェックシート②"],"not_rendered":{"charts":0,"images":11,"macros":1,"external_links":0,"defined_names":29,"comments":20,"pivot_tables":0},"unopened":[],"bounds":{"document_bytes":16777216,"sheet_cells":100000,"rows_first":2000,"rows_last":500,"rows_between":2000,"halvings":0,"cell_chars":16384,"cell_head_chars":4096},"cells_cut":0,"cells_raw":0,"read":"whole","date_system":"1900"}

{"sheet":"県域情報","index":0,"n_rows":32,"n_cols":2,"rows_kept":32,"cut":false,"hidden":true,"merged":[]}
["地域","支店"]
["大阪府","関西"]
["和歌山県","和歌山"]
["京都府","京都"]
["奈良県","奈良"]
["滋賀県","滋賀"]
["兵庫県","兵庫"]
["愛知県","東海"]
["静岡県","静岡"]
["岐阜県","岐阜"]
{"$rows_left_out":23}
{"sheet":"List","index":1,"n_rows":5,"n_cols":7,"rows_kept":5,"cut":false,"hidden":true,"merged":[]}
["新-様式5　記事","新-様式6　調整内容","新-様式6　調整相手","新-様式6-1　４．一束化の形態","新-様式14-1　電柱種別","新-様式7　建替・補強区分","新-様式8　工事の種類"]
["新規","NTT柱への添架","一般土地所有者","ケーブリング","単独柱","建替","添架工事"]
["増架（増設）","支線の設置","道路管理者","ラッシング","共架柱","補強","補修工事"]
["一束化","NTT柱への添架及び支線の設置","道路以外の公有地管理者","その他",null,null,"撤去工事"]
["他社一束化"]

{"sheet":"新-様式14コピー元","index":2,"n_rows":42,"n_cols":12,"rows_kept":42,"cut":false,"hidden":true,"merged":[[41,0,65,5],[41,6,65,11],[7,10,7,11],[11,1,11,2],[11,4,11,5],[14,0,38,5],[14,6,38,11]]}
[]
[]
[]
[null,null,null,null,null,null,null,null,null,null,null,"様式14"]
[]
["写真"]
[]
[null,null,null,null,null,null,null,null,null,null,{"$f":"IF(新規!T16=\"\",\"\",新規!T16)","v":""}]
[]
["申込書添付書類（電柱）　"]
{"$rows_left_out":33}
{"sheet":"新-様式14-1コピー元","index":3,"n_rows":47,"n_cols":12,"rows_kept":47,"cut":false,"hidden":true,"merged":[[17,0,42,11],[47,0,49,11],[7,10,7,11],[9,0,10,0],[9,1,10,1],[10,3,10,7],[12,0,12,2],[12,3,12,6]]}
[]
[]
[]
[null,null,null,null,null,null,null,null,null,null,null,"様式14-1"]
[]
["添架工法図（標準装柱図）"]
[]
[null,null,null,null,null,null,null,null,null,null,{"$f":"IF(新規!T16=\"\",\"\",新規!T16)","v":""}]
[]
["NO",null,"幹線名",null,"電柱番号",null,"電柱種別"]
{"$rows_left_out":38}
{"sheet":"新-様式14②コピー元","index":4,"n_rows":42,"n_cols":12,"rows_kept":42,"cut":false,"hidden":true,"merged":[[41,0,65,5],[41,6,65,11],[7,10,7,11],[11,1,11,2],[11,4,11,5],[14,0,38,5],[14,6,38,11]]}
[]
[]
[]
[null,null,null,null,null,null,null,null,null,null,null,"様式14"]
[]
["写真"]
[]
[null,null,null,null,null,null,null,null,null,null,{"$f":"IF(新規!T16=\"\",\"\",新規!T16)","v":""}]
[]
["申込書添付書類（電柱）　"]
{"$rows_left_out":33}
{"sheet":"廃解-様式14コピー元","index":5,"n_rows":42,"n_cols":12,"rows_kept":42,"cut":false,"hidden":true,"merged":[[41,0,65,5],[41,6,65,11],[7,10,7,11],[11,1,11,2],[11,4,11,5],[14,0,38,5],[14,6,38,11]]}
[]
[]
[]
[null,null,null,null,null,null,null,null,null,null,null,"様式14"]
[]
["写真"]
[]
[null,null,null,null,null,null,null,null,null,null,{"$f":"IF(廃止解約!T16=\"\",\"\",廃止解約!T16)","v":""}]
[]
["申込書添付書類（電柱）　"]
{"$rows_left_out":33}
{"sheet":"廃解-様式14②コピー元","index":6,"n_rows":42,"n_cols":12,"rows_kept":42,"cut":false,"hidden":true,"merged":[[41,0,65,5],[41,6,65,11],[7,10,7,11],[11,1,11,2],[11,4,11,5],[14,0,38,5],[14,6,38,11]]}
[]
[]
[]
[null,null,null,null,null,null,null,null,null,null,null,"様式14"]
[]
["写真"]
[]
[null,null,null,null,null,null,null,null,null,null,{"$f":"IF(廃止解約!T16=\"\",\"\",廃止解約!T16)","v":""}]
[]
["申込書添付書類（電柱）　"]
{"$rows_left_out":33}
{"sheet":"概要","index":7,"n_rows":35,"n_cols":52,"rows_kept":35,"cut":false,"hidden":true,"merged":[[15,2,18,6],[12,7,12,23],[18,7,18,23],[14,7,14,23],[13,7,13,23],[17,7,17,23],[15,7,15,23],[16,7,16,23],[12,2,14,6],[11,45,11,47],[12,24,12,26],[12,27,12,29],[12,30,12,32],[12,33,12,35],[12,36,12,38],[11,33,11,35],[11,36,11,38],[11,39,11,41],[11,42,11,44],[11,24,11,26],[11,27,11,29],[11,30,11,32],[12,39,12,41],[13,33,13,35],[13,36,13,38],[12,42,12,44],[12,45,12,47],[13,39,13,41],[13,42,13,44],[13,45,13,47],[13,24,13,26],[13,27,13,29],[13,30,13,32],[15,36,15,38],[14,24,14,26],[14,27,14,29],[14,30,14,32],[14,45,14,47],[14,33,14,35],[14,36,14,38],[14,39,14,41],[14,42,14,44],[15,39,15,41],[15,42,15,44],[15,45,15,47],[17,45,17,47],[10,1,11,1],[10,2,11,6],[10,7,11,23],[18,24,18,26],[18,27,18,29],[18,30,18,32],[16,45,16,47],[17,24,17,26],[17,27,17,29],[17,30,17,32],[17,33,17,35],[17,36,17,38],[16,33,16,35],[16,36,16,38],[16,39,16,41],[16,42,16,44],[16,24,16,26],[16,27,16,29],[16,30,16,32],[15,24,15,26],[15,27,15,29],[15,30,15,32],[15,33,15,35],[10,24,10,53],[16,51,16,53],[17,51,17,53],[18,51,18,53],[11,51,11,53],[12,51,12,53],[13,51,13,53],[14,51,14,53],[15,51,15,53],[18,45,18,47],[11,48,11,50],[12,48,12,50],[13,48,13,50],[14,48,14,50],[15,48,15,50],[16,48,16,50],[17,48,17,50],[18,48,18,50],[18,33,18,35],[18,36,18,38],[18,39,18,41],[18,42,18,44],[17,39,17,41],[17,42,17,44],[29,24,29,40],[30,24,30,40],[32,2,32,6],[32,7,32,23],[28,2,28,6],[28,7,28,23],[29,2,29,6],[29,7,29,23],[26,2,26,6],[26,7,26,23],[27,2,27,6],[27,7,27,23],[30,2,30,6],[30,7,30,23],[31,2,31,6],[31,7,31,23],[31,24,31,40],[32,24,32,40],[26,24,26,40],[27,24,27,40],[28,24,28,40],[22,24,22,40],[23,24,23,40],[24,24,24,40],[25,24,25,40],[23,2,23,6],[23,7,23,23],[24,2,24,6],[24,7,24,23],[25,2,25,6],[25,7,25,23],[22,2,22,6],[22,7,22,23]]}
["１．本ツールについて"]
[null,"本ツールは、各種添架申請を行う際に必要な申請書の作成を支援するツールです。"]
[null,"各シーンに必要な様式の申請書を作成することが出来ます。"]
[]
["２．申請の対象"]
[null,"添架申請：無線基地局申請"]
[]
["３．申請書の種別と様式"]
[null,"本ツールで作成出来る申請書の種別と、申請に必要な様式は下記の通りです。"]
[null,"各シーン毎に申請書を作成し、NTT西日本に提出、申請して下さい。"]
{"$rows_left_out":26}
{"sheet":"TOP","index":8,"n_rows":26,"n_cols":29,"rows_kept":26,"cut":false,"hidden":false,"merged":[[25,28,26,31]]}
[]
[null,"tenga"]
[]
[]
[]
[]
[]
[]
[]
[]
{"$rows_left_out":17}
{"sheet":"新規","index":9,"n_rows":51,"n_cols":42,"rows_kept":51,"cut":false,"hidden":false,"merged":[[28,34,28,45],[28,29,28,33],[20,19,20,45],[21,19,21,45],[22,19,22,45],[13,19,13,45],[14,19,14,45],[15,19,15,45],[16,19,16,45],[17,19,17,45],[18,19,18,45],[19,19,19,45],[3,7,5,38],[9,19,10,25],[7,19,8,45],[9,4,10,18],[9,41,10,45],[11,19,11,45],[12,19,12,45],[26,29,27,33],[26,34,27,45],[33,29,33,33],[34,29,34,33],[29,34,29,45],[30,34,30,45],[33,34,33,45],[34,34,34,45],[29,29,29,33],[30,29,30,33],[32,29,32,33],[32,34,32,45],[31,29,31,33],[31,34,31,45],[33,9,33,28],[34,9,34,28],[26,4,26,28],[27,4,27,8],[27,9,27,28],[28,9,28,28],[29,9,29,28],[30,9,30,28],[32,4,32,8],[32,9,32,28],[31,4,31,8],[31,9,31,28],[32,2,32,3],[34,2,34,3],[34,4,34,8],[30,2,30,3],[30,4,30,8],[31,2,31,3],[33,2,33,3],[33,4,33,8],[16,2,16,3],[17,2,17,3],[18,2,18,3],[19,2,19,3],[20,2,20,3],[26,2,27,3],[28,2,28,3],[28,4,28,8],[29,2,29,3],[9,2,10,3],[7,2,8,3],[7,4,8,18],[9,26,10,36],[9,37,10,40],[21,4,21,18],[22,4,22,18],[11,4,11,18],[12,4,12,18],[13,4,13,18],[14,4,14,18],[20,4,20,18],[15,4,15,18],[16,4,16,18],[17,4,17,18],[18,4,18,18],[19,4,19,18],[21,2,21,3],[22,2,22,3],[11,2,11,3],[12,2,12,3],[13,2,13,3],[14,2,14,3],[15,2,15,3],[40,2,40,3],[40,4,40,8],[40,9,40,28],[40,29,40,33],[40,34,40,45],[39,4,39,8],[39,9,39,28],[38,2,39,3],[38,4,38,28],[38,29,39,33],[38,34,39,45],[46,2,46,3],[46,4,46,8],[46,9,46,28],[46,29,46,33],[46,34,46,45],[44,2,45,3],[44,4,44,28],[44,29,45,33],[44,34,45,45],[45,4,45,8],[45,9,45,28],[48,2,48,3],[48,4,48,8],[48,9,48,28],[48,29,48,33],[48,34,48,45],[47,2,47,3],[47,4,47,8],[47,9,47,28],[47,29,47,33],[47,34,47,45]]}
[]
[]
[]
[null,null,null,null,null,null,null,"「新規申請」初期画面"]
[]
[]
[null,null,"１．基本情報の登録（各様式に反映されます）"]
[null,null,"№",null,"項目名",null,null,null,null,null,null,null,null,null,null,null,null,null,null,"入力項目"]
[]
[null,null,1,null," 地域",null,null,null,null,null,null,null,null,null,null,null,null,null,null,null,null,null,null,null,null,null,"NTT西日本申請先：",null,null,null,null,null,null,null,null,null,null,{"$f":"IF(新規!T10=\"\",\"\",VLOOKUP(新規!T10,県域情報!A2:B32,2,FALSE))","v":""},null,null,null,"支店 宛て"]
{"$rows_left_out":42}
{"sheet":"新-様式3-1","index":10,"n_rows":49,"n_cols":12,"rows_kept":49,"cut":false,"hidden":false,"merged":[[31,4,31,10],[32,4,32,10],[33,4,33,10],[26,4,26,8],[27,4,27,10],[28,4,28,10],[29,4,29,10],[30,4,30,10],[25,4,25,8],[11,3,11,4],[11,7,11,8],[11,9,11,11],[12,7,12,8],[12,9,12,10],[7,10,7,11],[9,0,9,1],[10,0,10,1],[15,3,15,4],[22,3,22,11]]}
[]
[]
[]
[null,null,null,null,null,null,null,null,null,null,null,"様式３-1"]
[]
["添 架 （ 変 更 ） 申 請 書　兼　添 架 内 諾 承 認 願（無線基地局）"]
[]
[null,null,null,null,null,null,null,null,null,null,{"$f":"IF(新規!T16=\"\",\"\",新規!T16)","v":""}]
["NTT西日本株式会社"]
[{"$f":"新規!AL10","v":""},null,"支店長　殿"]
{"$rows_left_out":40}
{"sheet":"新-様式5-1","index":11,"n_rows":14,"n_cols":12,"rows_kept":14,"cut":false,"hidden":false,"merged":[[29,10,31,12],[29,5,31,5],[29,0,31,0],[29,1,31,1],[29,2,31,2],[29,3,31,3],[29,4,31,4],[23,8,25,8],[23,9,25,9],[29,6,31,6],[29,7,31,7],[29,8,31,8],[29,9,31,9],[23,0,25,0],[23,1,25,1],[23,2,25,2],[23,3,25,3],[23,4,25,4],[26,10,28,12],[26,0,28,0],[26,1,28,1],[26,2,28,2],[26,3,28,3],[26,4,28,4],[26,5,28,5],[26,6,28,6],[26,7,28,7],[26,8,28,8],[26,9,28,9],[23,10,25,12],[17,5,19,5],[20,6,22,6],[20,7,22,7],[20,8,22,8],[20,9,22,9],[20,10,22,12],[20,5,22,5],[17,6,19,6],[17,7,19,7],[17,8,19,8],[17,9,19,9],[17,10,19,12],[23,5,25,5],[23,6,25,6],[23,7,25,7],[17,0,19,0],[17,1,19,1],[17,2,19,2],[17,3,19,3],[17,4,19,4],[20,0,22,0],[20,1,22,1],[20,2,22,2],[20,3,22,3],[20,4,22,4],[11,0,11,1],[11,10,13,12],[12,0,13,0],[12,1,13,1],[12,2,13,2],[12,3,13,3],[12,4,13,4],[12,5,12,9],[11,2,11,9],[14,0,16,0],[14,1,16,1],[14,2,16,2],[14,3,16,3],[14,4,16,4],[7,10,7,12],[9,9,9,12],[14,10,16,12],[14,5,16,5],[14,6,16,6],[14,7,16,7],[14,8,16,8],[14,9,16,9]]}
[]
[]
[]
[null,null,null,null,null,null,null,null,null,null,null,"様式5-1"]
[]
["添  架  施  設  明  細  書（無線基地局）"]
[]
[null,null,null,null,null,null,null,null,null,null,{"$f":"IF(新規!T16=\"\",\"\",新規!T16)","v":""}]
[]
[null,null,null,null,null,null,null,null,"会社名",{"$f":"IF(新規!T12=\"\",\"\",新規!T12)","v":""}]
{"$rows_left_out":5}
{"sheet":"新-様式6","index":12,"n_rows":43,"n_cols":12,"rows_kept":43,"cut":false,"hidden":false,"merged":[[40,0,41,11],[42,0,43,11],[38,0,39,11],[34,0,36,0],[34,1,36,1],[34,2,36,4],[34,5,36,8],[34,9,36,11],[31,0,33,0],[31,1,33,1],[31,2,33,4],[31,5,33,8],[31,9,33,11],[28,0,30,0],[28,1,30,1],[28,2,30,4],[28,5,30,8],[28,9,30,11],[25,0,27,0],[25,1,27,1],[25,2,27,4],[25,5,27,8],[25,9,27,11],[22,0,24,0],[22,1,24,1],[22,2,24,4],[22,5,24,8],[22,9,24,11],[19,0,21,0],[19,1,21,1],[19,2,21,4],[19,5,21,8],[19,9,21,11],[7,10,7,11],[9,0,9,1],[10,0,10,1],[15,0,16,11],[18,2,18,4],[18,5,18,8],[18,9,18,11],[11,7,11,8],[11,9,11,11],[12,7,12,8],[12,9,12,10]]}
[]
[]
[]
[null,null,null,null,null,null,null,null,null,null,"様式６"]
[]
["私 有 地 等  添 架 使 用 に 関 す る 調 整 完 了 報 告 書"]
[]
[null,null,null,null,null,null,null,null,null,null,{"$f":"IF(新規!T16=\"\",\"\",新規!T16)","v":""}]
["NTT西日本株式会社"]
[{"$f":"新規!AL10","v":""},null,"支店長　殿"]
{"$rows_left_out":34}
{"sheet":"新-様式14","index":13,"n_rows":42,"n_cols":12,"rows_kept":42,"cut":false,"hidden":false,"merged":[[41,0,65,5],[41,6,65,11],[7,10,7,11],[11,1,11,2],[11,4,11,5],[14,0,38,5],[14,6,38,11]]}
[]
[]
[]
[null,null,null,null,null,null,null,null,null,null,null,"様式14"]
[]
["写真"]
[]
[null,null,null,null,null,null,null,null,null,null,{"$f":"IF(新規!T16=\"\",\"\",新規!T16)","v":""}]
[]
["申込書添付書類（電柱）　"]
{"$rows_left_out":33}
{"sheet":"新-様式14-1","index":14,"n_rows":47,"n_cols":12,"rows_kept":47,"cut":false,"hidden":false,"merged":[[17,0,42,11],[47,0,49,11],[7,10,7,11],[9,0,10,0],[9,1,10,1],[10,3,10,7],[12,0,12,2],[12,3,12,6]]}
[]
[]
[]
[null,null,null,null,null,null,null,null,null,null,null,"様式14-1"]
[]
["添架工法図（標準装柱図）"]
[]
[null,null,null,null,null,null,null,null,null,null,{"$f":"IF(新規!T16=\"\",\"\",新規!T16)","v":""}]
[]
["NO",1,"幹線名",{"$f":"IF('新-様式5-1'!A15=\"\",\"\",'新-様式5-1'!A15)","v":""},"電柱番号",{"$f":"IF('新-様式5-1'!B15=\"\",\"\",'新-様式5-1'!B15)","v":""},"電柱種別"]
{"$rows_left_out":38}
{"sheet":"新-様式15","index":15,"n_rows":48,"n_cols":11,"rows_kept":48,"cut":false,"hidden":false,"merged":[[45,0,45,11],[46,0,46,11],[36,0,44,3],[36,4,38,5],[36,6,38,11],[39,4,41,5],[39,6,41,11],[42,4,44,5],[42,6,44,11],[27,0,35,3],[27,4,29,5],[27,6,29,11],[30,4,32,5],[30,6,32,11],[33,4,35,5],[33,6,35,11],[18,0,26,3],[18,4,20,5],[18,6,20,11],[21,4,23,5],[21,6,23,11],[24,4,26,5],[24,6,26,11],[7,8,7,11],[9,0,17,3],[9,4,11,5],[9,6,11,11],[12,4,14,5],[12,6,14,11],[15,4,17,5],[15,6,17,11]]}
[]
[]
[]
[null,null,null,null,null,null,null,null,null,null,"様式15"]
[]
["責任分担表"]
[]
[null,null,null,null,null,null,null,null,{"$f":"IF(新規!T16=\"\",\"\",新規!T16)","v":""}]
[]
["契約者　　　　　　　　　　　　　　　　（会社名等）",null,null,null,"住所"]
{"$rows_left_out":39}
{"sheet":"新-チェックシート","index":16,"n_rows":18,"n_cols":2,"rows_kept":18,"cut":false,"hidden":false,"merged":[[4,0,5,11],[16,10,17,10]]}
[]
[]
[]
[]
["（新規申請）郵送前チェックシート"]
[]
[]
[null,"様式3-1 添架（変更）申請書兼添架内諾承認願(無線基地局)"]
[null,"様式5-1 添架施設明細書(無線基地局)"]
[null,"様式6 私有地等添架使用に関する調整完了報告書"]
{"$rows_left_out":9}
{"sheet":"新-様式8","index":17,"n_rows":36,"n_cols":12,"rows_kept":36,"cut":false,"hidden":false,"merged":[[7,10,7,11],[19,0,19,4],[19,6,19,11],[20,0,20,4],[20,6,20,11],[15,0,15,11],[18,0,18,4],[18,6,18,11],[9,0,9,1],[10,0,10,1],[11,7,11,8],[11,9,11,11],[12,7,12,8],[12,9,12,10],[23,0,24,4],[23,6,23,11],[24,6,24,11],[21,0,22,4],[21,6,21,11],[22,6,22,11],[35,0,37,11],[30,0,31,11],[33,0,33,11],[34,0,34,11],[25,0,28,4],[25,6,25,11],[26,6,26,11],[27,6,27,11],[28,6,28,11]]}
[]
[]
[]
[null,null,null,null,null,null,null,null,null,null,"様式8"]
[]
["添架工事着工届"]
[]
[null,null,null,null,null,null,null,null,null,null,{"$f":"IF(新規!T16=\"\",\"\",新規!T16)","v":""}]
["NTT西日本株式会社"]
[{"$f":"新規!AL10","v":""},null,"支店長　殿"]
{"$rows_left_out":27}
{"sheet":"新-様式8-1","index":18,"n_rows":34,"n_cols":12,"rows_kept":34,"cut":false,"hidden":false,"merged":[[7,10,7,11],[19,0,21,4],[19,6,19,11],[20,6,20,11],[21,6,21,11],[15,0,15,11],[18,0,18,4],[18,6,18,11],[9,0,9,1],[10,0,10,1],[11,7,11,8],[11,9,11,11],[12,7,12,8],[12,9,12,10],[25,0,26,4],[25,6,25,11],[26,6,26,11],[22,0,22,4],[22,6,22,11],[23,0,24,4],[23,6,23,11],[24,6,24,11],[32,0,32,11],[27,0,30,4],[27,6,27,11],[28,6,28,11],[29,6,29,11],[30,6,30,11]]}
[]
[]
[]
[null,null,null,null,null,null,null,null,null,null,"様式8-1"]
[]
["添架工事完了届"]
[]
[null,null,null,null,null,null,null,null,null,null,{"$f":"IF(新規!T16=\"\",\"\",新規!T16)","v":""}]
["NTT西日本株式会社"]
[{"$f":"新規!AL10","v":""},null,"支店長　殿"]
{"$rows_left_out":25}
{"sheet":"新-様式14②","index":19,"n_rows":42,"n_cols":12,"rows_kept":42,"cut":false,"hidden":false,"merged":[[14,0,38,5],[14,6,38,11],[41,0,65,5],[41,6,65,11],[7,10,7,11],[11,1,11,2],[11,4,11,5]]}
[]
[]
[]
[null,null,null,null,null,null,null,null,null,null,null,"様式14"]
[]
["写真"]
[]
[null,null,null,null,null,null,null,null,null,null,{"$f":"IF(新規!T16=\"\",\"\",新規!T16)","v":""}]
[]
["申込書添付書類（電柱）　"]
{"$rows_left_out":33}
{"sheet":"新-チェックシート②","index":20,"n_rows":9,"n_cols":3,"rows_kept":9,"cut":false,"hidden":false,"merged":[[21,10,22,10],[12,3,12,8],[17,3,17,7],[18,3,18,8],[4,0,5,11],[10,10,11,10]]}
[]
[]
[]
[]
["（新規申請完了）郵送前チェックシート"]
[]
[]
[null,null,"様式8-1 添架工事完了届"]
[null,null,"様式14 写真"]

{"sheet":"廃止解約","index":21,"n_rows":51,"n_cols":42,"rows_kept":51,"cut":false,"hidden":false,"merged":[[11,2,11,3],[11,4,11,18],[11,19,11,45],[12,2,12,3],[12,4,12,18],[12,19,12,45],[3,7,5,38],[7,2,8,3],[7,4,8,18],[7,19,8,45],[9,2,10,3],[9,4,10,18],[9,19,10,25],[9,26,10,36],[9,37,10,40],[9,41,10,45],[15,2,15,3],[15,4,15,18],[15,19,15,45],[16,2,16,3],[16,4,16,18],[16,19,16,45],[13,2,13,3],[13,4,13,18],[13,19,13,45],[14,2,14,3],[14,4,14,18],[14,19,14,45],[19,2,19,3],[19,4,19,18],[19,19,19,45],[20,2,20,3],[20,4,20,18],[20,19,20,45],[17,2,17,3],[17,4,17,18],[17,19,17,45],[18,2,18,3],[18,4,18,18],[18,19,18,45],[26,2,27,3],[26,4,26,28],[26,29,27,33],[26,34,27,45],[27,4,27,8],[27,9,27,28],[21,2,21,3],[21,4,21,18],[21,19,21,45],[22,2,22,3],[22,4,22,18],[22,19,22,45],[28,2,28,3],[28,4,28,8],[28,9,28,28],[28,29,28,33],[28,34,28,45],[29,2,29,3],[29,9,29,28],[29,29,29,33],[29,34,29,45],[32,2,32,3],[32,4,32,8],[32,9,32,28],[32,29,32,33],[32,34,32,45],[30,2,30,3],[30,9,30,28],[30,29,30,33],[30,34,30,45],[31,2,31,3],[31,4,31,8],[31,9,31,28],[31,29,31,33],[31,34,31,45],[38,2,39,3],[38,4,38,28],[38,29,39,33],[38,34,39,45],[39,4,39,8],[39,9,39,28],[33,2,33,3],[33,4,33,8],[33,9,33,28],[33,29,33,33],[33,34,33,45],[45,9,45,28],[46,2,46,3],[46,4,46,8],[46,9,46,28],[46,29,46,33],[46,34,46,45],[40,2,40,3],[40,4,40,8],[40,9,40,28],[40,29,40,33],[40,34,40,45],[44,2,45,3],[44,4,44,28],[44,29,45,33],[44,34,45,45],[45,4,45,8],[47,2,47,3],[47,4,47,8],[47,9,47,28],[47,29,47,33],[47,34,47,45],[48,2,48,3],[48,4,48,8],[48,9,48,28],[48,29,48,33],[48,34,48,45]]}
[]
[]
[]
[null,null,null,null,null,null,null,"「廃止・解約申請」初期画面"]
[]
[]
[null,null,"１．基本情報の登録（各様式に反映されます）"]
[null,null,"№",null,"項目名",null,null,null,null,null,null,null,null,null,null,null,null,null,null,"入力項目"]
[]
[null,null,1,null," 地域",null,null,null,null,null,null,null,null,null,null,null,null,null,null,null,null,null,null,null,null,null,"NTT西日本申請先：",null,null,null,null,null,null,null,null,null,null,{"$f":"IF(廃止解約!T10=\"\",\"\",VLOOKUP(廃止解約!T10,県域情報!A2:B32,2,FALSE))","v":""},null,null,null,"支店 宛て"]
{"$rows_left_out":42}
{"sheet":"廃解-様式3-1","index":22,"n_rows":49,"n_cols":12,"rows_kept":49,"cut":false,"hidden":false,"merged":[[31,4,31,10],[32,4,32,10],[33,4,33,10],[26,4,26,8],[27,4,27,10],[28,4,28,10],[29,4,29,10],[30,4,30,10],[25,4,25,8],[11,3,11,4],[11,7,11,8],[11,9,11,11],[12,7,12,8],[12,9,12,10],[7,10,7,11],[9,0,9,1],[10,0,10,1],[15,3,15,4],[22,3,22,11]]}
["て"]
[]
[]
[null,null,null,null,null,null,null,null,null,null,null,"様式３-1"]
[]
["添 架 （ 変 更 ） 申 請 書　兼　添 架 内 諾 承 認 願（無線基地局）"]
[]
[null,null,null,null,null,null,null,null,null,null,{"$f":"IF(廃止解約!T16=\"\",\"\",廃止解約!T16)","v":""}]
["NTT西日本株式会社"]
[{"$f":"廃止解約!AL10","v":""},null,"支店長　殿"]
{"$rows_left_out":40}
{"sheet":"廃解-様式10","index":23,"n_rows":42,"n_cols":12,"rows_kept":42,"cut":false,"hidden":false,"merged":[[30,4,30,10],[31,4,31,10],[5,10,5,11],[7,0,7,1],[8,0,8,1],[10,7,10,8],[10,9,10,10],[13,0,13,11],[9,3,9,4],[9,7,9,8],[9,9,9,11],[22,0,22,2],[22,4,22,11],[24,0,24,2],[24,4,24,10],[16,1,16,10],[20,0,20,2],[20,4,20,10],[29,0,29,2],[29,4,29,10],[26,0,26,2],[26,4,26,8],[27,4,27,8],[41,0,42,11],[36,0,36,2],[36,4,36,10],[40,0,40,11],[32,4,32,10],[34,0,34,2],[34,4,34,10]]}
[]
[]
[]
[null,null,null,null,null,null,null,null,null,null,null,"様式10"]
[]
[null,null,null,null,null,null,null,null,null,null,{"$f":"IF(廃止解約!T16=\"\",\"\",廃止解約!T16)","v":""}]
["NTT西日本株式会社"]
[{"$f":"廃止解約!AL10","v":""},null,"支店長　殿"]
[]
[null,null,null,null,null,null,null,"契約会社名",null,{"$f":"IF(廃止解約!T12=\"\",\"\",廃止解約!T12)","v":""}]
{"$rows_left_out":33}
{"sheet":"廃解-様式5-1","index":24,"n_rows":14,"n_cols":12,"rows_kept":14,"cut":false,"hidden":false,"merged":[[29,9,31,9],[29,10,31,12],[29,0,31,0],[29,1,31,1],[29,2,31,2],[29,3,31,3],[29,4,31,4],[29,5,31,5],[26,5,28,5],[26,6,28,6],[26,7,28,7],[26,8,28,8],[29,6,31,6],[29,7,31,7],[29,8,31,8],[26,9,28,9],[26,10,28,12],[23,6,25,6],[23,7,25,7],[23,8,25,8],[23,9,25,9],[23,10,25,12],[26,0,28,0],[26,1,28,1],[26,2,28,2],[26,3,28,3],[26,4,28,4],[20,10,22,12],[23,0,25,0],[23,1,25,1],[23,2,25,2],[23,3,25,3],[23,4,25,4],[23,5,25,5],[20,5,22,5],[20,6,22,6],[20,7,22,7],[20,8,22,8],[20,9,22,9],[20,0,22,0],[20,1,22,1],[20,2,22,2],[20,3,22,3],[20,4,22,4],[14,10,16,12],[17,0,19,0],[17,1,19,1],[17,2,19,2],[17,3,19,3],[17,4,19,4],[17,5,19,5],[17,6,19,6],[17,7,19,7],[17,8,19,8],[17,9,19,9],[17,10,19,12],[14,5,16,5],[14,6,16,6],[14,7,16,7],[14,8,16,8],[14,9,16,9],[14,0,16,0],[14,1,16,1],[14,2,16,2],[14,3,16,3],[14,4,16,4],[7,10,7,12],[9,9,9,12],[11,0,11,1],[11,2,11,9],[11,10,13,12],[12,0,13,0],[12,1,13,1],[12,2,13,2],[12,3,13,3],[12,4,13,4],[12,5,12,9]]}
[]
[]
[]
[null,null,null,null,null,null,null,null,null,null,null,"様式5-1"]
[]
["添  架  施  設  明  細  書（無線基地局）"]
[]
[null,null,null,null,null,null,null,null,null,null,{"$f":"IF(廃止解約!T16=\"\",\"\",廃止解約!T16)","v":""}]
[]
[null,null,null,null,null,null,null,null,"会社名",{"$f":"IF(廃止解約!T12=\"\",\"\",廃止解約!T12)","v":""}]
{"$rows_left_out":5}
{"sheet":"廃解-様式6","index":25,"n_rows":43,"n_cols":12,"rows_kept":43,"cut":false,"hidden":false,"merged":[[40,0,41,11],[42,0,43,11],[34,0,36,0],[34,1,36,1],[34,2,36,4],[34,5,36,8],[34,9,36,11],[38,0,39,11],[28,0,30,0],[28,1,30,1],[28,2,30,4],[28,5,30,8],[28,9,30,11],[31,0,33,0],[31,1,33,1],[31,2,33,4],[31,5,33,8],[31,9,33,11],[22,0,24,0],[22,1,24,1],[22,2,24,4],[22,5,24,8],[22,9,24,11],[25,0,27,0],[25,1,27,1],[25,2,27,4],[25,5,27,8],[25,9,27,11],[15,0,16,11],[18,2,18,4],[18,5,18,8],[18,9,18,11],[19,0,21,0],[19,1,21,1],[19,2,21,4],[19,5,21,8],[19,9,21,11],[12,7,12,8],[12,9,12,10],[7,10,7,11],[9,0,9,1],[10,0,10,1],[11,7,11,8],[11,9,11,11]]}
[]
[]
[]
[null,null,null,null,null,null,null,null,null,null,"様式６"]
[]
["私 有 地 等  添 架 使 用 に 関 す る 調 整 完 了 報 告 書"]
[]
[null,null,null,null,null,null,null,null,null,null,{"$f":"IF(廃止解約!T16=\"\",\"\",廃止解約!T16)","v":""}]
["NTT西日本株式会社"]
[{"$f":"廃止解約!AL10","v":""},null,"支店長　殿"]
{"$rows_left_out":34}
{"sheet":"廃解-様式14","index":26,"n_rows":42,"n_cols":12,"rows_kept":42,"cut":false,"hidden":false,"merged":[[41,0,65,5],[41,6,65,11],[7,10,7,11],[11,1,11,2],[11,4,11,5],[14,0,38,5],[14,6,38,11]]}
[]
[]
[]
[null,null,null,null,null,null,null,null,null,null,null,"様式14"]
[]
["写真"]
[]
[null,null,null,null,null,null,null,null,null,null,{"$f":"IF(廃止解約!T16=\"\",\"\",廃止解約!T16)","v":""}]
[]
["申込書添付書類（電柱）　"]
{"$rows_left_out":33}
{"sheet":"廃解-チェックシート","index":27,"n_rows":12,"n_cols":1,"rows_kept":12,"cut":false,"hidden":false,"merged":[[4,0,5,11],[15,2,15,7],[11,10,12,10]]}
[]
[]
[]
[]
["（廃止・解約申請）郵送前チェックシート"]
[]
[]
["様式3-1添架（変更）申請書兼添架内諾承認願　\n※契約の一部を廃止する場合に使用"]
["様式10 添架契約解約申請書\n※全契約を解約する場合に使用"]
["様式5-1 添架施設明細書（無線基地局）"]
{"$rows_left_out":3}
{"sheet":"廃解-様式8","index":28,"n_rows":36,"n_cols":12,"rows_kept":36,"cut":false,"hidden":false,"merged":[[20,0,20,4],[20,6,20,11],[7,10,7,11],[9,0,9,1],[10,0,10,1],[11,7,11,8],[11,9,11,11],[12,7,12,8],[12,9,12,10],[15,0,15,11],[18,0,18,4],[18,6,18,11],[19,0,19,4],[19,6,19,11],[21,0,22,4],[21,6,21,11],[22,6,22,11],[23,0,24,4],[23,6,23,11],[24,6,24,11],[33,0,33,11],[34,0,34,11],[35,0,37,11],[25,0,28,4],[25,6,25,11],[26,6,26,11],[27,6,27,11],[28,6,28,11],[30,0,31,11]]}
[]
[]
[]
[null,null,null,null,null,null,null,null,null,null,"様式8"]
[]
["添架工事着工届"]
[]
[null,null,null,null,null,null,null,null,null,null,{"$f":"IF(廃止解約!T16=\"\",\"\",廃止解約!T16)","v":""}]
["NTT西日本株式会社"]
[{"$f":"廃止解約!AL10","v":""},null,"支店長　殿"]
{"$rows_left_out":27}
{"sheet":"廃解-様式8-1","index":29,"n_rows":34,"n_cols":12,"rows_kept":34,"cut":false,"hidden":false,"merged":[[12,7,12,8],[12,9,12,10],[7,10,7,11],[9,0,9,1],[10,0,10,1],[11,7,11,8],[11,9,11,11],[15,0,15,11],[18,0,18,4],[18,6,18,11],[19,0,21,4],[19,6,19,11],[20,6,20,11],[21,6,21,11],[32,0,32,11],[22,0,22,4],[22,6,22,11],[23,0,24,4],[23,6,23,11],[24,6,24,11],[25,0,26,4],[25,6,25,11],[26,6,26,11],[27,0,30,4],[27,6,27,11],[28,6,28,11],[29,6,29,11],[30,6,30,11]]}
[]
[]
[]
[null,null,null,null,null,null,null,null,null,null,"様式8-1"]
[]
["添架工事完了届"]
[]
[null,null,null,null,null,null,null,null,null,null,{"$f":"IF(廃止解約!T16=\"\",\"\",廃止解約!T16)","v":""}]
["NTT西日本株式会社"]
[{"$f":"廃止解約!AL10","v":""},null,"支店長　殿"]
{"$rows_left_out":25}
{"sheet":"廃解-様式14②","index":30,"n_rows":42,"n_cols":12,"rows_kept":42,"cut":false,"hidden":false,"merged":[[41,0,65,5],[41,6,65,11],[7,10,7,11],[11,1,11,2],[11,4,11,5],[14,0,38,5],[14,6,38,11]]}
[]
[]
[]
[null,null,null,null,null,null,null,null,null,null,null,"様式14"]
[]
["写真"]
[]
[null,null,null,null,null,null,null,null,null,null,{"$f":"IF(廃止解約!T16=\"\",\"\",廃止解約!T16)","v":""}]
[]
["申込書添付書類（電柱）　"]
{"$rows_left_out":33}
{"sheet":"廃解-チェックシート②","index":31,"n_rows":9,"n_cols":3,"rows_kept":9,"cut":false,"hidden":false,"merged":[[21,10,22,10],[4,0,5,11],[10,10,11,10],[12,3,12,8],[17,3,17,7],[18,3,18,8]]}
[]
[]
[]
[]
["（解約申請完了）郵送前チェックシート"]
[]
[]
[null,null,"様式8-1 添架工事完了届"]
[null,null,"様式14 写真"]